BDBM412765 US10399987, Example 30::methyl (4-((2-(6-(trifluoromethyl)pyridin-2-yl)-7H-pyrrolo[2,3-d]pyrimidin-4-yl)amino)pyridin-2-yl)carbamate
SMILES COC(=O)Nc1cc(Nc2nc(nc3[nH]ccc23)-c2cccc(n2)C(F)(F)F)ccn1
InChI Key InChIKey=DGSFFDNRPYDJBR-UHFFFAOYSA-N
Data  2 IC50
  Tab Delimited (TSV)   2D SDfile   Computed 3D by Vconf -m prep SDfile
Find this compound or compounds like it in BindingDB:
Activity Spreadsheet -- Enzyme Inhibition Constant Data from BindingDB
Found 2 hits for monomerid = 412765
TargetTGF-beta receptor type-2(Homo sapiens (Human))
Bristol-Myer Squibb
US Patent
LigandPNGBDBM412765(US10399987, Example 30 | methyl (4-((2-(6-(trifluo...)
Affinity DataIC50: >1.50E+4nM. Assay description: Assays are conducted in 1536-well plates and 2 mL reactions are prepared from addition of HIS-TGFβR1 T204D or HIS-TGFβR2 WT, anti-HIS detec...
Ligand Info
In DepthDetails US Patent
TargetTGF-beta receptor type-1 [4-503,T204D](Homo sapiens (Human))
Bristol-Myer Squibb
US Patent
LigandPNGBDBM412765(US10399987, Example 30 | methyl (4-((2-(6-(trifluo...)
Affinity DataIC50:  2.5nM. Assay description: Assays are conducted in 1536-well plates and 2 mL reactions are prepared from addition of HIS-TGFβR1 T204D or HIS-TGFβR2 WT, anti-HIS detec...
Ligand Info
In DepthDetails US Patent