BDBM412769 N-(3-fluoropyridin-4-yl)-5-methyl-2-(6-(trifluoromethyl)pyridin-2-yl)-7H-pyrrolo[2,3-d]pyrimidin-4-amine::US10399987, Example 34
SMILES Cc1c[nH]c2nc(nc(Nc3ccncc3F)c12)-c1cccc(n1)C(F)(F)F
InChI Key InChIKey=LHCFVFBVSVEMLZ-UHFFFAOYSA-N
Data  2 IC50
  Tab Delimited (TSV)   2D SDfile   Computed 3D by Vconf -m prep SDfile
Find this compound or compounds like it in BindingDB:
Activity Spreadsheet -- Enzyme Inhibition Constant Data from BindingDB
Found 2 hits for monomerid = 412769
TargetTGF-beta receptor type-2(Homo sapiens (Human))
Bristol-Myer Squibb
US Patent
LigandPNGBDBM412769(N-(3-fluoropyridin-4-yl)-5-methyl-2-(6-(trifluorom...)
Affinity DataIC50: >1.50E+4nM. Assay description: Assays are conducted in 1536-well plates and 2 mL reactions are prepared from addition of HIS-TGFβR1 T204D or HIS-TGFβR2 WT, anti-HIS detec...
Ligand Info
In DepthDetails US Patent
TargetTGF-beta receptor type-1 [4-503,T204D](Homo sapiens (Human))
Bristol-Myer Squibb
US Patent
LigandPNGBDBM412769(N-(3-fluoropyridin-4-yl)-5-methyl-2-(6-(trifluorom...)
Affinity DataIC50:  4.5nM. Assay description: Assays are conducted in 1536-well plates and 2 mL reactions are prepared from addition of HIS-TGFβR1 T204D or HIS-TGFβR2 WT, anti-HIS detec...
Ligand Info
In DepthDetails US Patent