BDBM412775 3-chloro-N-{2-[6-(trifluoromethyl)pyridin-2-yl]-7H-pyrrolo[2,3-d]pyrimidin-4-yl}pyridin-4-amine::US10399987, Example 40
SMILES FC(F)(F)c1cccc(n1)-c1nc(Nc2ccncc2Cl)c2cc[nH]c2n1
InChI Key InChIKey=WDJWKQYJNPIICW-UHFFFAOYSA-N
Data  2 IC50
  Tab Delimited (TSV)   2D SDfile   Computed 3D by Vconf -m prep SDfile
Find this compound or compounds like it in BindingDB:
Activity Spreadsheet -- Enzyme Inhibition Constant Data from BindingDB
Found 2 hits for monomerid = 412775
TargetTGF-beta receptor type-2(Homo sapiens (Human))
Bristol-Myer Squibb
US Patent
LigandPNGBDBM412775(3-chloro-N-{2-[6-(trifluoromethyl)pyridin-2-yl]-7H...)
Affinity DataIC50: >1.50E+4nM. Assay description: Assays are conducted in 1536-well plates and 2 mL reactions are prepared from addition of HIS-TGFβR1 T204D or HIS-TGFβR2 WT, anti-HIS detec...
Ligand Info
In DepthDetails US Patent
TargetTGF-beta receptor type-1 [4-503,T204D](Homo sapiens (Human))
Bristol-Myer Squibb
US Patent
LigandPNGBDBM412775(3-chloro-N-{2-[6-(trifluoromethyl)pyridin-2-yl]-7H...)
Affinity DataIC50:  0.600nM. Assay description: Assays are conducted in 1536-well plates and 2 mL reactions are prepared from addition of HIS-TGFβR1 T204D or HIS-TGFβR2 WT, anti-HIS detec...
Ligand Info
In DepthDetails US Patent