BDBM412826 N-[[4-[4-amino-1-(4-methoxycyclohexyl)pyrazolo[3,4-d]pyrimidin-3-yl]phenyl]methyl]-2-methoxy-benzamid::US10399989, Example 39::US10611766, Example 39
SMILES COC1CCC(CC1)n1nc(-c2ccc(CNC(=O)c3ccccc3OC)cc2)c2c(N)ncnc12
InChI Key InChIKey=VKHLIGZYZGNAAT-UHFFFAOYSA-N
Data  8 IC50
  Tab Delimited (TSV)   2D SDfile   Computed 3D by Vconf -m prep SDfile
Find this compound or compounds like it in BindingDB:
Activity Spreadsheet -- Enzyme Inhibition Constant Data from BindingDB
Found 8 hits for monomerid = 412826
TargetTyrosine-protein kinase BTK(Homo sapiens (Human))
Loxo Oncology
US Patent
LigandPNGBDBM412826(N-[[4-[4-amino-1-(4-methoxycyclohexyl)pyrazolo[3,4...)
Affinity DataIC50:  1.40nM. Assay description: BTKWT binding affinity of each compound tested was determined using a time-resolved fluorescence resonance energy transfer (TR-FRET) methodology. 2.5...
Ligand Info
In DepthDetails US Patent
TargetTyrosine-protein kinase BTK(Homo sapiens (Human))
Loxo Oncology
US Patent
LigandPNGBDBM412826(N-[[4-[4-amino-1-(4-methoxycyclohexyl)pyrazolo[3,4...)
Affinity DataIC50: <10nM. Assay description: BTKWT binding affinity of each compound tested was determined using a time-resolved fluorescence resonance energy transfer (TR-FRET) methodology. 2.5...
Ligand Info
In DepthDetails US Patent
TargetTyrosine-protein kinase BTK [C481S](Homo sapiens (Human))
Loxo Oncology
US Patent
LigandPNGBDBM412826(N-[[4-[4-amino-1-(4-methoxycyclohexyl)pyrazolo[3,4...)
Affinity DataIC50: <10nM. Assay description: BTKC481S binding affinity of each compound tested was determined using a time-resolved fluorescence resonance energy transfer (TR-FRET) methodology. ...
Ligand Info
In DepthDetails US Patent
TargetTyrosine-protein kinase BTK(Homo sapiens (Human))
Loxo Oncology
US Patent
LigandPNGBDBM412826(N-[[4-[4-amino-1-(4-methoxycyclohexyl)pyrazolo[3,4...)
Affinity DataIC50:  1.40nM. Assay description: BTKWT binding affinity of each compound tested was determined using a time-resolved fluorescence resonance energy transfer (TR-FRET) methodology. 2.5...
Ligand Info
In DepthDetails US Patent
TargetTyrosine-protein kinase BTK(Homo sapiens (Human))
Loxo Oncology
US Patent
LigandPNGBDBM412826(N-[[4-[4-amino-1-(4-methoxycyclohexyl)pyrazolo[3,4...)
Affinity DataIC50: <10nM. Assay description: BTKWT binding affinity of each compound tested was determined using a time-resolved fluorescence resonance energy transfer (TR-FRET) methodology. 2.5...
Ligand Info
In DepthDetails US Patent
TargetTyrosine-protein kinase BTK [C481S](Homo sapiens (Human))
Loxo Oncology
US Patent
LigandPNGBDBM412826(N-[[4-[4-amino-1-(4-methoxycyclohexyl)pyrazolo[3,4...)
Affinity DataIC50: <10nM. Assay description: BTKC481S binding affinity of each compound tested was determined using a time-resolved fluorescence resonance energy transfer (TR-FRET) methodology. ...
Ligand Info
In DepthDetails US Patent
TargetEpidermal growth factor receptor(Homo sapiens (Human))
Loxo Oncology
US Patent
LigandPNGBDBM412826(N-[[4-[4-amino-1-(4-methoxycyclohexyl)pyrazolo[3,4...)
Affinity DataIC50:  550nM. Assay description: EGFR binding affinity was determined using a time-resolved fluorescence resonance energy transfer (TR-FRET) methodology. 2.5 nM Recombinant EGFR, var...
Ligand Info
In DepthDetails US Patent
TargetEpidermal growth factor receptor(Homo sapiens (Human))
Loxo Oncology
US Patent
LigandPNGBDBM412826(N-[[4-[4-amino-1-(4-methoxycyclohexyl)pyrazolo[3,4...)
Affinity DataIC50:  550nM. Assay description: EGFR binding affinity was determined using a time-resolved fluorescence resonance energy transfer (TR-FRET) methodology. 2.5 nM Recombinant EGFR, var...
Ligand Info
In DepthDetails US Patent