BDBM413437 2-(morpholin-4-yl)ethyl 2-(4-{[2-amino-4-(pentylamino)-5H-pyrrolo[3,2-d]pyrimidin-5-yl]methyl}-3-methoxyphenyl)acetate::US10407431, Example 24
SMILES CCCCCNc1nc(N)nc2ccn(Cc3ccc(CC(=O)OCCN4CCOCC4)cc3OC)c12
InChI Key InChIKey=CXFIJOIUEFZMPL-UHFFFAOYSA-N
Data  1 EC50
  Tab Delimited (TSV)   2D SDfile   Computed 3D by Vconf -m prep SDfile
Find this compound or compounds like it in BindingDB:
Activity Spreadsheet -- Enzyme Inhibition Constant Data from BindingDB
Found 1 hit for monomerid = 413437
TargetToll-like receptor 7(Homo sapiens (Human))
Novartis
US Patent
LigandPNGBDBM413437(2-(morpholin-4-yl)ethyl 2-(4-{[2-amino-4-(pentylam...)
Affinity DataEC50:  8nM. Assay description: Human embryonic kidney 293 (HEK 293) cells were stably transfected with human TLR7 and an NF-kB-driven luciferase reporter vector (pNifty-Luciferase)...
Ligand Info
In DepthDetails US Patent