BDBM414519 N-(2-(4-(2-Hydroxypropan-2-yl)-5-methyloxazol-2-yl)ethyl)-N-(3-methoxypropyl)-2-(2H-1,2,3-triazol-2-yl)benzamide::US10435398, Example 33
SMILES COCCCN(CCc1nc(c(C)o1)C(C)(C)O)C(=O)c1ccccc1-n1nccn1
InChI Key InChIKey=JJDVXGGWZPRFDC-UHFFFAOYSA-N
Data  2 IC50
  Tab Delimited (TSV)   2D SDfile   Computed 3D by Vconf -m prep SDfile
Find this compound or compounds like it in BindingDB:
Activity Spreadsheet -- Enzyme Inhibition Constant Data from BindingDB
Found 2 hits for monomerid = 414519
TargetOrexin/Hypocretin receptor type 1(Homo sapiens (Human))
Merck Sharp & Dohme
US Patent
LigandPNGBDBM414519(N-(2-(4-(2-Hydroxypropan-2-yl)-5-methyloxazol-2-yl...)
Affinity DataIC50:  1.00E+4nM. Assay description: In a typical experiment the OX1 and OX2 receptor antagonistic activity of the compounds of the present invention was determined in accordance with th...
Ligand InfoPC cidPC sid
In DepthDetails US Patent
TargetOrexin receptor type 2(Homo sapiens (Human))
Merck Sharp & Dohme
US Patent
LigandPNGBDBM414519(N-(2-(4-(2-Hydroxypropan-2-yl)-5-methyloxazol-2-yl...)
Affinity DataIC50:  119nM. Assay description: In a typical experiment the OX1 and OX2 receptor antagonistic activity of the compounds of the present invention was determined in accordance with th...
Ligand InfoPC cidPC sid
In DepthDetails US Patent