BDBM414632 US10435405, Example 49::US10934288, Example 49
SMILES CN1CCN(CC1)c1ccc(cc1)-c1n[nH]c2cnc(cc12)-c1c(C)cccc1F
InChI Key InChIKey=LEGRNKHXWBMICP-UHFFFAOYSA-N
Data  2 KI
  Tab Delimited (TSV)   2D SDfile   Computed 3D by Vconf -m prep SDfile
Find this compound or compounds like it in BindingDB:
Activity Spreadsheet -- Enzyme Inhibition Constant Data from BindingDB
Found 1 hit for monomerid = 414632
TargetMitogen-activated protein kinase kinase kinase kinase 1(Homo sapiens (Human))
Incyte
US Patent
LigandPNGBDBM414632(US10435405, Example 49 | US10934288, Example 49)
Affinity DataKi: <100nM. Assay description: A stock solution of 1 mM test compound was prepared in DMSO. The compound plate was prepared by 3-fold and 11-point serial dilutions. 0.1 μL of ...
Ligand InfoPC cidPC sid
In DepthDetails US Patent