BDBM415915 US10442772, Example 2-231-2
SMILES CC(C)c1ccc(Nc2nc3cc(CC(O)=O)ccc3n2[C@H]2C[C@@H](C)CC(C)(C)C2)cc1
InChI Key InChIKey=RBDPRDBWQJOHTD-GCJKJVERSA-N
Data  1 IC50
  Tab Delimited (TSV)   2D SDfile   Computed 3D by Vconf -m prep SDfile
Find this compound or compounds like it in BindingDB:
Activity Spreadsheet -- Enzyme Inhibition Constant Data from BindingDB
Found 1 hit for monomerid = 415915
TargetIsocitrate dehydrogenase [NADP] cytoplasmic [R132H](Homo sapiens (Human))
Bayer Pharma Aktiengesellschaft
US Patent
LigandPNGBDBM415915(US10442772, Example 2-231-2)
Affinity DataIC50:  20nM. Assay description: The biochemical reactions were performed at 32° C. in 384-well plates using a reaction volume of 41 μL and the following assay buffer conditions...
Ligand InfoPC cidPC sid
In DepthDetails US Patent