BDBM41625 3-(2-pyridinyl)-6-(trifluoromethyl)-2-thieno[3,2-b]pyridinecarboxylic acid methyl ester::3-(2-pyridyl)-6-(trifluoromethyl)thieno[3,2-b]pyridine-2-carboxylic acid methyl ester::SR-01000755162-2::cid_1486478::methyl 3-pyridin-2-yl-6-(trifluoromethyl)thieno[3,2-b]pyridine-2-carboxylate
SMILES COC(=O)c1sc2cc(cnc2c1-c1ccccn1)C(F)(F)F
InChI Key InChIKey=DEQDEIDIVREGPF-UHFFFAOYSA-N
Data  2 IC50
  Tab Delimited (TSV)   2D SDfile   Computed 3D by Vconf -m prep SDfile
Find this compound or compounds like it in BindingDB:
Activity Spreadsheet -- Enzyme Inhibition Constant Data from BindingDB
Found 1 hit for monomerid = 41625
TargetSphingosine 1-phosphate receptor 2(Homo sapiens (Human))
The Scripps Research Institute Molecular Screening Center
Curated by PubChem BioAssay
LigandPNGBDBM41625(3-(2-pyridinyl)-6-(trifluoromethyl)-2-thieno[3,2-b...)
Affinity DataIC50: >3.00E+4nM. Assay description: Source (MLSCN Center Name): The Scripps Research Institute Molecular Screening Center Center Affiliation: The Scripps Research Institute (TSRI) Assay...
In DepthDetails PCBioAssay