BDBM418925 US10450301, Example 4
SMILES CC(C)n1cnnc1-c1cccc(NC(=O)c2ccc3CN(Cc3c2)S(=O)(=O)CCC(F)(F)F)n1
InChI Key InChIKey=OQTBEXRUIWVATH-UHFFFAOYSA-N
Data  1 IC50
  Tab Delimited (TSV)   2D SDfile   Computed 3D by Vconf -m prep SDfile
Find this compound or compounds like it in BindingDB:
Activity Spreadsheet -- Enzyme Inhibition Constant Data from BindingDB
Found 1 hit for monomerid = 418925
TargetMitogen-activated protein kinase kinase kinase 5(Homo sapiens (Human))
Enanta Pharmaceuticals
US Patent
LigandPNGBDBM418925(US10450301, Example 4)
Affinity DataIC50:  550nM. Assay description: HTRF KinEASE-STK is a generic method for measuring serine/threonine kinase activities using a time-resolved fluorescence resonance energy transfer (T...
Ligand InfoPC cidPC sid
In DepthDetails US Patent