BDBM419566 US10464907, Compound 11j::US10889552, Compound 11j
SMILES CN1CCN(C(C1)c1ccccc1)C(=O)c1cc(Cl)c(O)cc1O
InChI Key InChIKey=ALEGUOAREHPDLU-UHFFFAOYSA-N
Data  2 IC50
  Tab Delimited (TSV)   2D SDfile   Computed 3D by Vconf -m prep SDfile
Find this compound or compounds like it in BindingDB:
Activity Spreadsheet -- Enzyme Inhibition Constant Data from BindingDB
Found 1 hit for monomerid = 419566
TargetHeat shock protein HSP 90-alpha(Bovine)
Industry Academic Cooperation Foundation Keimyung University
US Patent
LigandPNGBDBM419566(US10464907, Compound 11j | US10889552, Compound 11...)
Affinity DataIC50:  70nM. Assay description: Fluorescence polarization assay was performed to confirm the binding ability to the compound synthesized with HSP90 according the concentration. 1 M ...
Ligand InfoPC cidPC sid
In DepthDetails US Patent