BDBM419880 US10464927, Compound I-28
SMILES CC(C)n1c(cc2c(F)c(ccc12)-c1nc(Nc2ccc(cn2)N2CCNCC2)ncc1F)C(=O)N(C)C
InChI Key InChIKey=SCBGKGYVHKAFEK-UHFFFAOYSA-N
Data  2 IC50
  Tab Delimited (TSV)   2D SDfile   Computed 3D by Vconf -m prep SDfile
Find this compound or compounds like it in BindingDB:
Activity Spreadsheet -- Enzyme Inhibition Constant Data from BindingDB
Found 2 hits for monomerid = 419880
TargetCyclin-dependent kinase 6(Homo sapiens (Human))
Shanghai Xunhe Pharmaceutical Technology
US Patent
LigandPNGBDBM419880(US10464927, Compound I-28)
Affinity DataIC50:  60nM. Assay description: CDK6: The test compound was dissolved in DMSO and diluted with a kinase buffer solution (20 mM HEPES-pH 7.5, 0.01% Triton X-100, 10 mM MgCl2, 2 mM D...
Ligand InfoPC cidPC sid
In DepthDetails US Patent
TargetCyclin-dependent kinase 4(Homo sapiens (Human))
Shanghai Xunhe Pharmaceutical Technology
US Patent
LigandPNGBDBM419880(US10464927, Compound I-28)
Affinity DataIC50: <20nM. Assay description: CDK4: The test compound was dissolved in DMSO and diluted with a kinase buffer solution (20 mM HEPES-pH 7.5, 0.01% Triton X-100, 10 mM MgCl2, 2 mM DT...
Ligand InfoPC cidPC sid
In DepthDetails US Patent