BDBM42889 MLS000032959::N-[3-[[4-(cyclopropylsulfamoyl)phenyl]sulfonylamino]phenyl]-2-pyridinecarboxamide::N-[3-[[4-(cyclopropylsulfamoyl)phenyl]sulfonylamino]phenyl]picolinamide::N-[3-[[4-(cyclopropylsulfamoyl)phenyl]sulfonylamino]phenyl]pyridine-2-carboxamide::Pyridine-2-carboxylic acid [3-(4-cyclopropylsulfamoyl-benzenesulfonylamino)-phenyl]-amide::SMR000006019::cid_650456
SMILES O=C(Nc1cccc(NS(=O)(=O)c2ccc(cc2)S(=O)(=O)NC2CC2)c1)c1ccccn1
InChI Key InChIKey=FXEKYLIMEGOHLI-UHFFFAOYSA-N
Data  3 EC50
  Tab Delimited (TSV)   2D SDfile   Computed 3D by Vconf -m prep SDfile
Find this compound or compounds like it in BindingDB:
Activity Spreadsheet -- Enzyme Inhibition Constant Data from BindingDB
Found 3 hits for monomerid = 42889
TargetNuclear receptor coactivator 3(Homo sapiens (Human))
The Scripps Research Institute Molecular Screening Center
Curated by PubChem BioAssay
LigandPNGBDBM42889(MLS000032959 | N-[3-[[4-(cyclopropylsulfamoyl)phen...)
Affinity DataEC50: >7.94E+4nM. Assay description: Source (MLSCN Center Name): The Scripps Research Institute Molecular Screening Center http://molscreen.florida.scripps.edu/ Center Affiliation: The ...
In DepthDetails PCBioAssay
TargetNuclear receptor coactivator 1(Homo sapiens (Human))
The Scripps Research Institute Molecular Screening Center
Curated by PubChem BioAssay
LigandPNGBDBM42889(MLS000032959 | N-[3-[[4-(cyclopropylsulfamoyl)phen...)
Affinity DataEC50: >7.94E+4nM. Assay description: Source (MLSCN Center Name): The Scripps Research Institute Molecular Screening Center Center Affiliation: The Scripps Research Institute (TSRI) Assay...
In DepthDetails PCBioAssay
TargetNuclear receptor coactivator 2(Homo sapiens (Human))
The Scripps Research Institute Molecular Screening Center
Curated by PubChem BioAssay
LigandPNGBDBM42889(MLS000032959 | N-[3-[[4-(cyclopropylsulfamoyl)phen...)
Affinity DataEC50: >7.94E+4nM. Assay description: Source (MLSCN Center Name): The Scripps Research Institute Molecular Screening Center Center Affiliation: The Scripps Research Institute (TSRI) Assay...
In DepthDetails PCBioAssay