BDBM42905 MLS000082243::N-[(1S)-1-[5-(butylthio)-1,3,4-oxadiazol-2-yl]ethyl]carbamic acid tert-butyl ester::SMR000044131::cid_5389697::tert-butyl N-[(1S)-1-(5-butylsulfanyl-1,3,4-oxadiazol-2-yl)ethyl]carbamate
SMILES CCCCSc1nnc(o1)[C@H](C)NC(=O)OC(C)(C)C
InChI Key InChIKey=PCDQYGJYOSFXDE-VIFPVBQESA-N
Data  3 EC50
  Tab Delimited (TSV)   2D SDfile   Computed 3D by Vconf -m prep SDfile
Find this compound or compounds like it in BindingDB:
Activity Spreadsheet -- Enzyme Inhibition Constant Data from BindingDB
Found 3 hits for monomerid = 42905
TargetNuclear receptor coactivator 3(Homo sapiens (Human))
The Scripps Research Institute Molecular Screening Center
Curated by PubChem BioAssay
LigandPNGBDBM42905(MLS000082243 | N-[(1S)-1-[5-(butylthio)-1,3,4-oxad...)
Affinity DataEC50: >7.94E+4nM. Assay description: Source (MLSCN Center Name): The Scripps Research Institute Molecular Screening Center http://molscreen.florida.scripps.edu/ Center Affiliation: The ...
In DepthDetails PCBioAssay
TargetNuclear receptor coactivator 1(Homo sapiens (Human))
The Scripps Research Institute Molecular Screening Center
Curated by PubChem BioAssay
LigandPNGBDBM42905(MLS000082243 | N-[(1S)-1-[5-(butylthio)-1,3,4-oxad...)
Affinity DataEC50: >7.94E+4nM. Assay description: Source (MLSCN Center Name): The Scripps Research Institute Molecular Screening Center Center Affiliation: The Scripps Research Institute (TSRI) Assay...
In DepthDetails PCBioAssay
TargetNuclear receptor coactivator 2(Homo sapiens (Human))
The Scripps Research Institute Molecular Screening Center
Curated by PubChem BioAssay
LigandPNGBDBM42905(MLS000082243 | N-[(1S)-1-[5-(butylthio)-1,3,4-oxad...)
Affinity DataEC50: >7.94E+4nM. Assay description: Source (MLSCN Center Name): The Scripps Research Institute Molecular Screening Center Center Affiliation: The Scripps Research Institute (TSRI) Assay...
In DepthDetails PCBioAssay