BDBM42915 4-[3-[3-(p-tolyl)-1,2,4-oxadiazol-5-yl]propanoylamino]benzoic acid ethyl ester::4-[[3-[3-(4-methylphenyl)-1,2,4-oxadiazol-5-yl]-1-oxopropyl]amino]benzoic acid ethyl ester::MLS000083730::SMR000048224::cid_666868::ethyl 4-[3-[3-(4-methylphenyl)-1,2,4-oxadiazol-5-yl]propanoylamino]benzoate
SMILES CCOC(=O)c1ccc(NC(=O)CCc2nc(no2)-c2ccc(C)cc2)cc1
InChI Key InChIKey=SYVSBLUQSDSWKQ-UHFFFAOYSA-N
Data  3 EC50
  Tab Delimited (TSV)   2D SDfile   Computed 3D by Vconf -m prep SDfile
Find this compound or compounds like it in BindingDB:
Activity Spreadsheet -- Enzyme Inhibition Constant Data from BindingDB
Found 3 hits for monomerid = 42915
TargetNuclear receptor coactivator 3(Homo sapiens (Human))
The Scripps Research Institute Molecular Screening Center
Curated by PubChem BioAssay
LigandPNGBDBM42915(4-[3-[3-(p-tolyl)-1,2,4-oxadiazol-5-yl]propanoylam...)
Affinity DataEC50: >7.94E+4nM. Assay description: Source (MLSCN Center Name): The Scripps Research Institute Molecular Screening Center http://molscreen.florida.scripps.edu/ Center Affiliation: The ...
In DepthDetails PCBioAssay
TargetNuclear receptor coactivator 1(Homo sapiens (Human))
The Scripps Research Institute Molecular Screening Center
Curated by PubChem BioAssay
LigandPNGBDBM42915(4-[3-[3-(p-tolyl)-1,2,4-oxadiazol-5-yl]propanoylam...)
Affinity DataEC50: >7.94E+4nM. Assay description: Source (MLSCN Center Name): The Scripps Research Institute Molecular Screening Center Center Affiliation: The Scripps Research Institute (TSRI) Assay...
In DepthDetails PCBioAssay
TargetNuclear receptor coactivator 2(Homo sapiens (Human))
The Scripps Research Institute Molecular Screening Center
Curated by PubChem BioAssay
LigandPNGBDBM42915(4-[3-[3-(p-tolyl)-1,2,4-oxadiazol-5-yl]propanoylam...)
Affinity DataEC50: >7.94E+4nM. Assay description: Source (MLSCN Center Name): The Scripps Research Institute Molecular Screening Center Center Affiliation: The Scripps Research Institute (TSRI) Assay...
In DepthDetails PCBioAssay