BDBM42917 4-(1-imidazolylmethyl)-7,8-dihydro-6H-cyclopenta[g][1]benzopyran-2-one::4-(imidazol-1-ylmethyl)-7,8-dihydro-6H-cyclopenta[g]chromen-2-one::MLS000083479::SMR000048472::cid_667147
SMILES O=c1cc(Cn2ccnc2)c2cc3CCCc3cc2o1
InChI Key InChIKey=XNTYGTIXNHKBCE-UHFFFAOYSA-N
Data  3 EC50
  Tab Delimited (TSV)   2D SDfile   Computed 3D by Vconf -m prep SDfile
Find this compound or compounds like it in BindingDB:
Activity Spreadsheet -- Enzyme Inhibition Constant Data from BindingDB
Found 3 hits for monomerid = 42917
TargetNuclear receptor coactivator 3(Homo sapiens (Human))
The Scripps Research Institute Molecular Screening Center
Curated by PubChem BioAssay
LigandPNGBDBM42917(4-(1-imidazolylmethyl)-7,8-dihydro-6H-cyclopenta[g...)
Affinity DataEC50: >7.94E+4nM. Assay description: Source (MLSCN Center Name): The Scripps Research Institute Molecular Screening Center http://molscreen.florida.scripps.edu/ Center Affiliation: The ...
In DepthDetails PCBioAssay
TargetNuclear receptor coactivator 1(Homo sapiens (Human))
The Scripps Research Institute Molecular Screening Center
Curated by PubChem BioAssay
LigandPNGBDBM42917(4-(1-imidazolylmethyl)-7,8-dihydro-6H-cyclopenta[g...)
Affinity DataEC50: >7.94E+4nM. Assay description: Source (MLSCN Center Name): The Scripps Research Institute Molecular Screening Center Center Affiliation: The Scripps Research Institute (TSRI) Assay...
In DepthDetails PCBioAssay
TargetNuclear receptor coactivator 2(Homo sapiens (Human))
The Scripps Research Institute Molecular Screening Center
Curated by PubChem BioAssay
LigandPNGBDBM42917(4-(1-imidazolylmethyl)-7,8-dihydro-6H-cyclopenta[g...)
Affinity DataEC50: >7.94E+4nM. Assay description: Source (MLSCN Center Name): The Scripps Research Institute Molecular Screening Center Center Affiliation: The Scripps Research Institute (TSRI) Assay...
In DepthDetails PCBioAssay