BDBM429745 (R)-5-(3-(4-(3- chloro-5- methoxyphenyl) piperidin-1- yl)-3- oxopropyl)-5- methyl- imidazolidine- 2,4-dione::US10550100, Compound 66
SMILES COc1cc(Cl)cc(c1)C1CCN(CC1)C(=O)CC[C@@]1(C)NC(=O)NC1=O
InChI Key InChIKey=HQUNVDQSUFWCJN-LJQANCHMSA-N
Data  4 IC50
  Tab Delimited (TSV)   2D SDfile   Computed 3D by Vconf -m prep SDfile
Find this compound or compounds like it in BindingDB:
Activity Spreadsheet -- Enzyme Inhibition Constant Data from BindingDB
Found 4 hits for monomerid = 429745
TargetA disintegrin and metalloproteinase with thrombospondin motifs 5(Homo sapiens (Human))
Galapagos
US Patent
LigandPNGBDBM429745((R)-5-(3-(4-(3- chloro-5- methoxyphenyl) piperidin...)
Affinity DataIC50: >100nM. Assay description: The basis for the assay is the cleavage of the substrate TBIS-1 (5 FAM-TEGEARGSVILLK (5TAMRA)K-NH2) (SEQ ID NO: 2) by human ADAMTS-5.For the dose res...
Ligand InfoPC cidPC sid
In DepthDetails US Patent
TargetCollagenase 3(Homo sapiens (Human))
Galapagos
US Patent
LigandPNGBDBM429745((R)-5-(3-(4-(3- chloro-5- methoxyphenyl) piperidin...)
Affinity DataIC50: >100nM. Assay description: The basis for the assay is the cleavage of the substrate 390 MMP FRET Substrate I (Anaspec Cat# AS-27076) by human MMP13 (Chemicon, Cat#CC068).For th...
Ligand InfoPC cidPC sid
In DepthDetails US Patent
TargetDisintegrin and metalloproteinase domain-containing protein 17(Homo sapiens (Human))
Galapagos
US Patent
LigandPNGBDBM429745((R)-5-(3-(4-(3- chloro-5- methoxyphenyl) piperidin...)
Affinity DataIC50:  37.5nM. Assay description: The basis for the assay is the cleavage of the substrate 5FAM-LAQAVRSSSRK-5TAMRA (SEQ ID No 3) (Anaspec, custom 34891) by human TACE (R&D SYSTEMS INC...
Ligand InfoPC cidPC sid
In DepthDetails US Patent
LigandPNGBDBM429745((R)-5-(3-(4-(3- chloro-5- methoxyphenyl) piperidin...)
Affinity DataIC50:  12.5nM. Assay description: The basis for the assay is the cleavage of the substrate 520 MMP FRET substrate XII by human ADAMTS6.The substrate contains sequence Arg-Pro-Lys-Pro-...
Ligand InfoPC cidPC sid
In DepthDetails US Patent