BDBM429778 5-[3-[4-(4- chloro-3- fluoro-5- methoxy- phenyl)-1- piperidyl]-2- methyl-3-oxo- methyl- imidazolidine- 2,4-dione::US10550100, Compound 102
SMILES COc1cc(cc(F)c1Cl)C1CCN(CC1)C(=O)[C@@H](C)C[C@@]1(C)NC(=O)NC1=O
InChI Key InChIKey=IUOVINQVOHJYDU-PRWKNARSSA-N
Data  5 IC50
  Tab Delimited (TSV)   2D SDfile   Computed 3D by Vconf -m prep SDfile
Find this compound or compounds like it in BindingDB:
Activity Spreadsheet -- Enzyme Inhibition Constant Data from BindingDB
Found 5 hits for monomerid = 429778
TargetA disintegrin and metalloproteinase with thrombospondin motifs 5(Homo sapiens (Human))
Galapagos
US Patent
LigandPNGBDBM429778(5-[3-[4-(4- chloro-3- fluoro-5- methoxy- phenyl)-1...)
Affinity DataIC50:  37.5nM. Assay description: The basis for the assay is the cleavage of the substrate TBIS-1 (5 FAM-TEGEARGSVILLK (5TAMRA)K-NH2) (SEQ ID NO: 2) by human ADAMTS-5.For the dose res...
Ligand InfoPC cidPC sid
In DepthDetails US Patent
LigandPNGBDBM429778(5-[3-[4-(4- chloro-3- fluoro-5- methoxy- phenyl)-1...)
Affinity DataIC50:  12.5nM. Assay description: The basis for the assay is the cleavage of the substrate 520 MMP FRET substrate XII by human ADAMTS6.The substrate contains sequence Arg-Pro-Lys-Pro-...
Ligand InfoPC cidPC sid
In DepthDetails US Patent
TargetMatrix metalloproteinase-14(Homo sapiens (Human))
Galapagos
US Patent
LigandPNGBDBM429778(5-[3-[4-(4- chloro-3- fluoro-5- methoxy- phenyl)-1...)
Affinity DataIC50: >100nM. Assay description: The basis for the assay is the cleavage of the substrate 390 MMP FRET Substrate I (Anaspec Cat# AS-27076) by human MMP14 (Biomol, Cat#SE-259).For the...
Ligand InfoPC cidPC sid
In DepthDetails US Patent
TargetCollagenase 3(Homo sapiens (Human))
Galapagos
US Patent
LigandPNGBDBM429778(5-[3-[4-(4- chloro-3- fluoro-5- methoxy- phenyl)-1...)
Affinity DataIC50: >100nM. Assay description: The basis for the assay is the cleavage of the substrate 390 MMP FRET Substrate I (Anaspec Cat# AS-27076) by human MMP13 (Chemicon, Cat#CC068).For th...
Ligand InfoPC cidPC sid
In DepthDetails US Patent
TargetDisintegrin and metalloproteinase domain-containing protein 17(Homo sapiens (Human))
Galapagos
US Patent
LigandPNGBDBM429778(5-[3-[4-(4- chloro-3- fluoro-5- methoxy- phenyl)-1...)
Affinity DataIC50:  75nM. Assay description: The basis for the assay is the cleavage of the substrate 5FAM-LAQAVRSSSRK-5TAMRA (SEQ ID No 3) (Anaspec, custom 34891) by human TACE (R&D SYSTEMS INC...
Ligand InfoPC cidPC sid
In DepthDetails US Patent