BDBM433449 US10562850, Compound 42l::US10562850, Compound 43m::US11066360, Compound 43m
SMILES CO[C@@H]1C[C@@H](N(C1)C(=O)Nc1ccc(Cl)cn1)C(=O)Nc1cc(ccc1F)C(CCC1CC1)n1ccccc1=O
InChI Key InChIKey=XUORFTPJFLKHSK-TYIXABJVSA-N
Data  3 KI
  Tab Delimited (TSV)   2D SDfile   Computed 3D by Vconf -m prep SDfile
Find this compound or compounds like it in BindingDB:
Activity Spreadsheet -- Enzyme Inhibition Constant Data from BindingDB
Found 1 hit for monomerid = 433449
TargetPlasma kallikrein(Homo sapiens (Human))
Biocryst Pharmaceuticals
US Patent
LigandPNGBDBM433449(US10562850, Compound 42l | US10562850, Compound 43...)
Affinity DataKi:  75nM. Assay description: The effect of compounds of the invention on human plasma kallikrein activity was determined using the chromogenic substrates (DiaPharma Group, Inc., ...
Ligand InfoPC cidPC sid
In DepthDetails US Patent