BDBM434718 US10562902, Compound 124
SMILES Cn1cc(cn1)-n1ccc2nc(Nc3ccc4cn[nH]c4c3)nc(O[C@H]3CCOC3)c12
InChI Key InChIKey=UKVFVMKYENZUSV-INIZCTEOSA-N
Data  1 IC50
  Tab Delimited (TSV)   2D SDfile   Computed 3D by Vconf -m prep SDfile
Find this compound or compounds like it in BindingDB:
Activity Spreadsheet -- Enzyme Inhibition Constant Data from BindingDB
Found 1 hit for monomerid = 434718
TargetInterleukin-1 receptor-associated kinase 4(Homo sapiens (Human))
Beijing Hanmi Pharmaceutical
US Patent
LigandPNGBDBM434718(US10562902, Compound 124)
Affinity DataIC50:  550nM. Assay description: IRAK4 kinase (purchased from Life Technologies, Cat. No.: PR5612U) was diluted to 2 folds of the final concentration (the final concentration is 0.76...
Ligand InfoPC cidPC sid
In DepthDetails US Patent