BDBM434962 US10584098, Code ELQ-374
SMILES Cc1nc2cc(CO)c(Cl)cc2c(OC(=O)OCC2COC(C)(C)O2)c1-c1ccc(Oc2ccc(OC(F)(F)F)cc2)cc1
InChI Key InChIKey=WUVGCVSIVPGKHA-UHFFFAOYSA-N
Data  1 IC50
  Tab Delimited (TSV)   2D SDfile   Computed 3D by Vconf -m prep SDfile
Find this compound or compounds like it in BindingDB:
Activity Spreadsheet -- Enzyme Inhibition Constant Data from BindingDB
Found 1 hit for monomerid = 434962
TargetChloroquine resistance transporter(Plasmodium falciparum)
Oregon Health & Science University
US Patent
LigandPNGBDBM434962(US10584098, Code ELQ-374)
Affinity DataIC50:  2.70nM. Assay description: In vitro experiments show that the intrinsic antiplasmodial activity of ethylcarbonate ester ELQ-337 is indistinguishable from ELQ-300, with IC50 val...
Ligand InfoPC cidPC sid
In DepthDetails ArticleUS Patent