BDBM434963 US10584098, Code ELQ-375
SMILES CC(C)C(=O)Oc1c(c(C)nc2cc(CO)c(Cl)cc12)-c1ccc(Oc2ccc(OC(F)(F)F)cc2)cc1
InChI Key InChIKey=CGZMROFGNYXKAY-UHFFFAOYSA-N
Data  1 IC50
  Tab Delimited (TSV)   2D SDfile   Computed 3D by Vconf -m prep SDfile
Find this compound or compounds like it in BindingDB:
Activity Spreadsheet -- Enzyme Inhibition Constant Data from BindingDB
Found 1 hit for monomerid = 434963
TargetChloroquine resistance transporter(Plasmodium falciparum)
Oregon Health & Science University
US Patent
LigandPNGBDBM434963(US10584098, Code ELQ-375)
Affinity DataIC50:  8.20nM. Assay description: In vitro experiments show that the intrinsic antiplasmodial activity of ethylcarbonate ester ELQ-337 is indistinguishable from ELQ-300, with IC50 val...
Ligand InfoPC cidPC sid
In DepthDetails ArticleUS Patent