BDBM435115 US10584120, Compound 48
SMILES CC#CCn1nnc(n1)-c1ccc(cc1)C1N(C(=O)NC1=O)c1ccc2[nH]cnc2c1
InChI Key
Data  1 KI
  Tab Delimited (TSV)   2D SDfile   Computed 3D by Vconf -m prep SDfile
Find this compound or compounds like it in BindingDB:
Activity Spreadsheet -- Enzyme Inhibition Constant Data from BindingDB
Found 1 hit for monomerid = 435115
TargetGlutaminyl-peptide cyclotransferase(Homo sapiens (Human))
National Health Research Institutes
US Patent
LigandPNGBDBM435115(US10584120, Compound 48)
Affinity DataKi:  10nM. Assay description: An inhibition activity assay of QC inhibitors was conducted. See Huang et al., J. Biol. Chem. 2011, 286, 12439-12449. A reaction mixture containing 3...
Ligand InfoPC cidPC sid
In DepthDetails US Patent