BDBM435252 US10568876, Example 17::methyl 3-(2-(tert-butylcarbamoyl)-8- ((spiro[2.5]octane-1- carboxamido)methyl)-1,2,3,4- tetrahydroisoquinolin-5-yl)benzoate
SMILES COC(=O)c1cccc(c1)-c1ccc(CNC(=O)C2CC22CCCCC2)c2CN(CCc12)C(=O)NC(C)(C)C
InChI Key InChIKey=PUNZSINNPQLZQG-UHFFFAOYSA-N
Data  1 IC50
  Tab Delimited (TSV)   2D SDfile   Computed 3D by Vconf -m prep SDfile
Find this compound or compounds like it in BindingDB:
Activity Spreadsheet -- Enzyme Inhibition Constant Data from BindingDB
Found 1 hit for monomerid = 435252
TargetDiacylglycerol O-acyltransferase 2(Homo sapiens (Human))
Merck Sharp & Dohme
US Patent
LigandPNGBDBM435252(US10568876, Example 17 | methyl 3-(2-(tert-butylca...)
Affinity DataIC50:  2.20nM. Assay description: DGAT2 activity was determined by measuring the amount of enzymatic product triolein (1,2,3-Tri(cis-9-octadecenoyl)glycerol) using the membrane prep m...
Ligand InfoPC cidPC sid
In DepthDetails US Patent