BDBM435274 N-(tert-butyl)-5-(1-isobutyl-1H- pyrazol-4-yl)-8-(((trans)-2- phenylcyclopropanecarboxamido) methyl)-3,4-dihydroisoquinoline-2(1H)- carboxamide (mixture of 2 isomers)::US10568876, Example 37
SMILES CC(C)Cn1cc(cn1)-c1ccc(CNC(=O)C2C[C@H]2c2ccccc2)c2CN(CCc12)C(=O)NC(C)(C)C
InChI Key InChIKey=SIKIQTORZBGWSI-MBMZGMDYSA-N
Data  1 IC50
  Tab Delimited (TSV)   2D SDfile   Computed 3D by Vconf -m prep SDfile
Find this compound or compounds like it in BindingDB:
Activity Spreadsheet -- Enzyme Inhibition Constant Data from BindingDB
Found 1 hit for monomerid = 435274
TargetDiacylglycerol O-acyltransferase 2(Homo sapiens (Human))
Merck Sharp & Dohme
US Patent
LigandPNGBDBM435274(N-(tert-butyl)-5-(1-isobutyl-1H- pyrazol-4-yl)-8-(...)
Affinity DataIC50:  95.6nM. Assay description: DGAT2 activity was determined by measuring the amount of enzymatic product triolein (1,2,3-Tri(cis-9-octadecenoyl)glycerol) using the membrane prep m...
Ligand InfoPC cidPC sid
In DepthDetails US Patent