BDBM435290 US10568876, Example 53
SMILES COc1cccc(c1)-c1ccc(CNC(=O)C2CC2c2nc(C)no2)c2CN(CCc12)C(=O)NC1(C)COC1
InChI Key InChIKey=BRBHIWXKEJSRLG-UHFFFAOYSA-N
Data  1 IC50
  Tab Delimited (TSV)   2D SDfile   Computed 3D by Vconf -m prep SDfile
Find this compound or compounds like it in BindingDB:
Activity Spreadsheet -- Enzyme Inhibition Constant Data from BindingDB
Found 1 hit for monomerid = 435290
TargetDiacylglycerol O-acyltransferase 2(Homo sapiens (Human))
Merck Sharp & Dohme
US Patent
LigandPNGBDBM435290(US10568876, Example 53)
Affinity DataIC50:  13.4nM. Assay description: DGAT2 activity was determined by measuring the amount of enzymatic product triolein (1,2,3-Tri(cis-9-octadecenoyl)glycerol) using the membrane prep m...
Ligand InfoPC cidPC sid
In DepthDetails US Patent