BDBM435379 US10568876, Example 138::methyl 3-(2-benzoyl-8-((2- phenylcyclopropanecarboxamido)methyl)- 1,2,3,4-tetrahydroisoquinolin-5- yl)benzoate (mixture of 4 isomers)
SMILES COC(=O)c1cccc(c1)-c1ccc(CNC(=O)C2CC2c2ccccc2)c2CN(CCc12)C(=O)c1ccccc1
InChI Key InChIKey=JDCKXMVNLBYHPZ-UHFFFAOYSA-N
Data  1 IC50
  Tab Delimited (TSV)   2D SDfile   Computed 3D by Vconf -m prep SDfile
Find this compound or compounds like it in BindingDB:
Activity Spreadsheet -- Enzyme Inhibition Constant Data from BindingDB
Found 1 hit for monomerid = 435379
TargetDiacylglycerol O-acyltransferase 2(Homo sapiens (Human))
Merck Sharp & Dohme
US Patent
LigandPNGBDBM435379(US10568876, Example 138 | methyl 3-(2-benzoyl-8-((...)
Affinity DataIC50:  176nM. Assay description: DGAT2 activity was determined by measuring the amount of enzymatic product triolein (1,2,3-Tri(cis-9-octadecenoyl)glycerol) using the membrane prep m...
Ligand InfoPC cidPC sid
In DepthDetails US Patent