BDBM435710 (2R,3S,4R,5R)-5-(4-amino-7H- pyrrolo[2,3-d]pyrimidin-7-yl)-3-methyl-2- (((3-methylimidazo[1,2-a]pyridin-7- yl)oxy)methyl)tetrahydrofuran-3,4-diol::US10570140, Example 68::US11078205, Example 68::US11208416, Example 68
SMILES Cc1cnc2cc(OC[C@H]3O[C@H]([C@H](O)[C@]3(C)O)n3ccc4c(N)ncnc34)ccn12
InChI Key InChIKey=XGNCIUCSKJERPK-HIBPSGHXSA-N
Data  3 IC50
  Tab Delimited (TSV)   2D SDfile   Computed 3D by Vconf -m prep SDfile
Find this compound or compounds like it in BindingDB:
Activity Spreadsheet -- Enzyme Inhibition Constant Data from BindingDB
Found 3 hits for monomerid = 435710
TargetMethylosome protein 50/Protein arginine N-methyltransferase 5(Homo sapiens (Human))
Prelude Therapeutics
US Patent
LigandPNGBDBM435710((2R,3S,4R,5R)-5-(4-amino-7H- pyrrolo[2,3-d]pyrimid...)
Affinity DataIC50:  0.900nM. Assay description: Compounds were solubilized and 3-fold diluted in 100% DMSO. These diluted compounds were further diluted in the assay buffer (50 mM Tris-HCl, pH 8.5,...
Ligand InfoPC cidPC sid
In DepthDetails US Patent
TargetMethylosome protein 50/Protein arginine N-methyltransferase 5(Homo sapiens (Human))
Prelude Therapeutics
US Patent
LigandPNGBDBM435710((2R,3S,4R,5R)-5-(4-amino-7H- pyrrolo[2,3-d]pyrimid...)
Affinity DataIC50:  0.900nM. Assay description: Compounds were solubilized and 3-fold diluted in 100% DMSO. These diluted compounds were further diluted in the assay buffer (50 mM Tris-HCl, pH 8.5,...
Ligand InfoPC cidPC sid
In DepthDetails US Patent
TargetProtein arginine N-methyltransferase 5(Homo sapiens (Human))
Prelude Therapeutics
US Patent
LigandPNGBDBM435710((2R,3S,4R,5R)-5-(4-amino-7H- pyrrolo[2,3-d]pyrimid...)
Affinity DataIC50:  0.900nM. Assay description: Compounds were solubilized and 3-fold diluted in 100% DMSO. These diluted compounds were further diluted in the assay buffer (50 mM Tris-HCl, pH 8.5,...
Ligand InfoPC cidPC sid
In DepthDetails US Patent