BDBM438834 N-{[5-(Ethylsulfonyl)pyridin-2-yl]methyl}-5′,5′-dimethyl-1-{(1R)-1-[2-(trifluoromethyl)pyrimidin-5-yl]ethyl}-4′,5′-dihydrospiro[piperidine-4,7′-thieno[2,3-c]pyran]-2′-carboxamide::US10603320, Example 5
SMILES CCS(=O)(=O)c1ccc(CNC(=O)c2cc3CC(C)(C)OC4(CCN(CC4)[C@H](C)c4cnc(nc4)C(F)(F)F)c3s2)nc1
InChI Key InChIKey=QIYAHWJLMQLCDQ-GOSISDBHSA-N
Data  3 KI
  Tab Delimited (TSV)   2D SDfile   Computed 3D by Vconf -m prep SDfile
Find this compound or compounds like it in BindingDB:
Activity Spreadsheet -- Enzyme Inhibition Constant Data from BindingDB
Found 3 hits for monomerid = 438834
TargetNuclear receptor ROR-gamma(Homo sapiens (Human))
Eli Lilly
US Patent
LigandPNGBDBM438834(N-{[5-(Ethylsulfonyl)pyridin-2-yl]methyl}-5′...)
Affinity DataKi:  6.96nM. Assay description: His-tagged human RAR-related orphan receptor alpha (hRORa), human RAR-related orphan receptor beta (hRORb), and human RAR-related orphan receptor gam...
Ligand InfoPC cidPC sid
In DepthDetails US Patent
TargetNuclear receptor ROR-alpha(Homo sapiens (Human))
Eli Lilly
US Patent
LigandPNGBDBM438834(N-{[5-(Ethylsulfonyl)pyridin-2-yl]methyl}-5′...)
Affinity DataKi:  5.68E+3nM. Assay description: His-tagged human RAR-related orphan receptor alpha (hRORa), human RAR-related orphan receptor beta (hRORb), and human RAR-related orphan receptor gam...
Ligand InfoPC cidPC sid
In DepthDetails US Patent
TargetRAR related orphan receptor B isoform 1(Human)
Eli Lilly
US Patent
LigandPNGBDBM438834(N-{[5-(Ethylsulfonyl)pyridin-2-yl]methyl}-5′...)
Affinity DataKi: >1.25E+4nM. Assay description: His-tagged human RAR-related orphan receptor alpha (hRORa), human RAR-related orphan receptor beta (hRORb), and human RAR-related orphan receptor gam...
Ligand InfoPC cidPC sid
In DepthDetails US Patent