BDBM439128 US10604514, Compound 4
SMILES CC(C)CN1CCC(CC(=O)Nc2cc3cc(ccc3cn2)-c2cnn(C)c2)C1
InChI Key InChIKey=WKRDKZGECQJUME-UHFFFAOYSA-N
Data  2 EC50
  Tab Delimited (TSV)   2D SDfile   Computed 3D by Vconf -m prep SDfile
Find this compound or compounds like it in BindingDB:
Activity Spreadsheet -- Enzyme Inhibition Constant Data from BindingDB
Found 2 hits for monomerid = 439128
TargetGlycogen synthase kinase-3 beta(Homo sapiens (Human))
Samumed
US Patent
LigandPNGBDBM439128(US10604514, Compound 4)
Affinity DataEC50:  22nM. Assay description: Briefly, recombinant GSK3β kinase, ATP and Ser/Thr peptide 09 are prepared in 1× Kinase buffer to final concentrations of 0.04 μg/mL, 46 &...
Ligand InfoPC cidPC sid
In DepthDetails US Patent
TargetDual specificity tyrosine-phosphorylation-regulated kinase 1A(Homo sapiens (Human))
Samumed
US Patent
LigandPNGBDBM439128(US10604514, Compound 4)
Affinity DataEC50:  4nM. Assay description: Briefly, recombinant DYRK1A kinase, ATP and Ser/Thr peptide 18 were prepared in 1× Kinase buffer to final concentrations of 0.19 μg/mL, 30 _...
Ligand InfoPC cidPC sid
In DepthDetails US Patent