BDBM44136 MLS000709180::N-[2-(2-fluorophenyl)-1,3-benzoxazol-5-yl]-2-furamide::N-[2-(2-fluorophenyl)-1,3-benzoxazol-5-yl]-2-furancarboxamide::N-[2-(2-fluorophenyl)-1,3-benzoxazol-5-yl]furan-2-carboxamide::SMR000289847::cid_1071269
SMILES Fc1ccccc1-c1nc2cc(NC(=O)c3ccco3)ccc2o1
InChI Key InChIKey=KDVFQNOKIVNOAB-UHFFFAOYSA-N
Data  2 EC50
  Tab Delimited (TSV)   2D SDfile   Computed 3D by Vconf -m prep SDfile
Find this compound or compounds like it in BindingDB:
Activity Spreadsheet -- Enzyme Inhibition Constant Data from BindingDB
Found 2 hits for monomerid = 44136
TargetSolute carrier family 12 member 5(Homo sapiens (Human))
Vanderbilt Screening Center For Gpcrs, Ion Channels and Transporters
Curated by PubChem BioAssay
LigandPNGBDBM44136(MLS000709180 | N-[2-(2-fluorophenyl)-1,3-benzoxazo...)
Affinity DataEC50:  8.27E+5nM. Assay description: Vanderbilt Screening Center for GPCRs, Ion Channels and Transporters Assay Provider: Eric Delpire Assay Provider Affliation: Vanderbilt University Gr...
In DepthDetails PCBioAssay
TargetSolute carrier family 12 member 5(Homo sapiens (Human))
Vanderbilt Screening Center For Gpcrs, Ion Channels and Transporters
Curated by PubChem BioAssay
LigandPNGBDBM44136(MLS000709180 | N-[2-(2-fluorophenyl)-1,3-benzoxazo...)
Affinity DataEC50:  6.65E+4nM. Assay description: Vanderbilt Screening Center for GPCRs, Ion Channels and Transporters Assay Provider: Eric Delpire Assay Provider Affliation: Vanderbilt University Gr...
In DepthDetails PCBioAssay