BDBM44422 3-benzyl-6,6-dimethyl-5,7-dihydro-1H-indazol-4-one::6,6-dimethyl-3-(phenylmethyl)-5,7-dihydro-1H-indazol-4-one::MLS000113801::SMR000109693::cid_705460
SMILES CC1(C)Cc2n[nH]c(Cc3ccccc3)c2C(=O)C1
InChI Key InChIKey=PNIAQTXJVGYYMH-UHFFFAOYSA-N
Data  4 IC50
  Tab Delimited (TSV)   2D SDfile   Computed 3D by Vconf -m prep SDfile
Find this compound or compounds like it in BindingDB:
Activity Spreadsheet -- Enzyme Inhibition Constant Data from BindingDB
Found 1 hit for monomerid = 44422
TargetAlkaline phosphatase, germ cell type(Homo sapiens (Human))
Burnham Center For Chemical Genomics
Curated by PubChem BioAssay
LigandPNGBDBM44422(3-benzyl-6,6-dimethyl-5,7-dihydro-1H-indazol-4-one...)
Affinity DataIC50: >1.00E+5nM. Assay description: Data Source: Sanford-Burnham Center for Chemical Genomics (SBCCG) Source Affiliation: Sanford-Burnham Medical Research Institute (SBMRI, San Diego, C...
In DepthDetails PCBioAssay