BDBM444298 US10660898, Example 11
SMILES CC(C)c1nc2c(O)cc(cc2n1Cc1cccc2ccccc12)N1CCOCC1
InChI Key InChIKey=LZWXRZNGKKZRTB-UHFFFAOYSA-N
Data  1 IC50
  Tab Delimited (TSV)   2D SDfile   Computed 3D by Vconf -m prep SDfile
Find this compound or compounds like it in BindingDB:
Activity Spreadsheet -- Enzyme Inhibition Constant Data from BindingDB
Found 1 hit for monomerid = 444298
TargetPhosphatidylinositol 4-phosphate 3-kinase C2 domain-containing subunit beta(Homo sapiens (Human))
Glaxosmithkline
US Patent
LigandPNGBDBM444298(US10660898, Example 11)
Affinity DataIC50:  2nM. Assay description: PI3Kinase Reaction Buffer was prepared by diluting the stock 1:4 with de-ionized water. Freshly prepared DTT was added at a final concentration of 5 ...
Ligand InfoPC cidPC sid
In DepthDetails US Patent