BDBM444311 US10660898, Example 39
SMILES Cc1nc2c(cc(cc2n1Cc1cccc(c1C)C(F)(F)F)N1CCOCC1)-c1nnc[nH]1
InChI Key InChIKey=VZQJJFCLZQINTF-UHFFFAOYSA-N
Data  1 IC50
  Tab Delimited (TSV)   2D SDfile   Computed 3D by Vconf -m prep SDfile
Find this compound or compounds like it in BindingDB:
Activity Spreadsheet -- Enzyme Inhibition Constant Data from BindingDB
Found 1 hit for monomerid = 444311
TargetPhosphatidylinositol 4-phosphate 3-kinase C2 domain-containing subunit beta(Homo sapiens (Human))
Glaxosmithkline
US Patent
LigandPNGBDBM444311(US10660898, Example 39)
Affinity DataIC50:  0.631nM. Assay description: PI3Kinase Reaction Buffer was prepared by diluting the stock 1:4 with de-ionized water. Freshly prepared DTT was added at a final concentration of 5 ...
Ligand InfoPC cidPC sid
In DepthDetails US Patent