BDBM444516 US10662186, Compound 38::US10988476, Compound I-38
SMILES CC(C)n1c(C)nc2c(F)cc(cc12)-c1nc(Nc2ccc3CN(CCc3n2)C(=O)C=C)ncc1F
InChI Key InChIKey=SOHOEERULHWXJB-UHFFFAOYSA-N
Data  12 IC50
  Tab Delimited (TSV)   2D SDfile   Computed 3D by Vconf -m prep SDfile
Find this compound or compounds like it in BindingDB:
Activity Spreadsheet -- Enzyme Inhibition Constant Data from BindingDB
Found 12 hits for monomerid = 444516
TargetCyclin-dependent kinase 4(Homo sapiens (Human))
Shanghai Pharmaceuticals Holding
US Patent
LigandPNGBDBM444516(US10662186, Compound 38 | US10988476, Compound I-3...)
Affinity DataIC50:  2.34nM. Assay description: 1. Take 10 mM stock solution of the test compound, in 96-well compound plate, DMSO was used to dilute the compound to an initial concentration of 100...
Ligand InfoPC cidPC sid
In DepthDetails US Patent
TargetCyclin-dependent kinase 6(Homo sapiens (Human))
Shanghai Pharmaceuticals Holding
US Patent
LigandPNGBDBM444516(US10662186, Compound 38 | US10988476, Compound I-3...)
Affinity DataIC50:  4.37nM. Assay description: 1. Take 10 mM stock solution of the test compound, in 96-well compound plate, DMSO was used to dilute the compound to an initial concentration of 100...
Ligand InfoPC cidPC sid
In DepthDetails US Patent
TargetCyclin-dependent kinase 2(Homo sapiens (Human))
Shanghai Pharmaceuticals Holding
US Patent
LigandPNGBDBM444516(US10662186, Compound 38 | US10988476, Compound I-3...)
Affinity DataIC50:  32.3nM. Assay description: 1. Take 10 mM stock solution of the test compound, in 96-well compound plate, DMSO was used to dilute the compound to an initial concentration of 100...
Ligand InfoPC cidPC sid
In DepthDetails US Patent
TargetCyclin-dependent kinase 1(Homo sapiens (Human))
Shanghai Pharmaceuticals Holding
US Patent
LigandPNGBDBM444516(US10662186, Compound 38 | US10988476, Compound I-3...)
Affinity DataIC50:  26.2nM. Assay description: 1. Take 10 mM stock solution of the test compound, in 96-well compound plate, DMSO was used to dilute the compound to an initial concentration of 100...
Ligand InfoPC cidPC sid
In DepthDetails US Patent
TargetCyclin-dependent kinase 7(Homo sapiens (Human))
Shanghai Pharmaceuticals Holding
US Patent
LigandPNGBDBM444516(US10662186, Compound 38 | US10988476, Compound I-3...)
Affinity DataIC50: >3.00E+4nM. Assay description: 1. Take 10 mM stock solution of the test compound, in 96-well compound plate, DMSO was used to dilute the compound to an initial concentration of 100...
Ligand InfoPC cidPC sid
In DepthDetails US Patent
TargetCyclin-dependent kinase 9(Homo sapiens (Human))
Shanghai Pharmaceuticals Holding
US Patent
LigandPNGBDBM444516(US10662186, Compound 38 | US10988476, Compound I-3...)
Affinity DataIC50:  0.920nM. Assay description: 1. Take 10 mM stock solution of the test compound, in 96-well compound plate, DMSO was used to dilute the compound to an initial concentration of 100...
Ligand InfoPC cidPC sid
In DepthDetails US Patent
TargetCyclin-dependent kinase 4(Homo sapiens (Human))
Shanghai Pharmaceuticals Holding
US Patent
LigandPNGBDBM444516(US10662186, Compound 38 | US10988476, Compound I-3...)
Affinity DataIC50:  2.34nM. Assay description: 1. Take 10 mM stock solution of the test compound, in 96-well compound plate, DMSO was used to dilute the compound to an initial concentration of 100...
Ligand InfoPC cidPC sid
In DepthDetails US Patent
TargetCyclin-dependent kinase 6(Homo sapiens (Human))
Shanghai Pharmaceuticals Holding
US Patent
LigandPNGBDBM444516(US10662186, Compound 38 | US10988476, Compound I-3...)
Affinity DataIC50:  4.37nM. Assay description: 1. Take 10 mM stock solution of the test compound, in 96-well compound plate, DMSO was used to dilute the compound to an initial concentration of 100...
Ligand InfoPC cidPC sid
In DepthDetails US Patent
TargetCyclin-dependent kinase 2(Homo sapiens (Human))
Shanghai Pharmaceuticals Holding
US Patent
LigandPNGBDBM444516(US10662186, Compound 38 | US10988476, Compound I-3...)
Affinity DataIC50:  32.3nM. Assay description: 1. Take 10 mM stock solution of the test compound, in 96-well compound plate, DMSO was used to dilute the compound to an initial concentration of 100...
Ligand InfoPC cidPC sid
In DepthDetails US Patent
TargetCyclin-dependent kinase 1(Homo sapiens (Human))
Shanghai Pharmaceuticals Holding
US Patent
LigandPNGBDBM444516(US10662186, Compound 38 | US10988476, Compound I-3...)
Affinity DataIC50:  26.2nM. Assay description: 1. Take 10 mM stock solution of the test compound, in 96-well compound plate, DMSO was used to dilute the compound to an initial concentration of 100...
Ligand InfoPC cidPC sid
In DepthDetails US Patent
TargetCyclin-dependent kinase 7(Homo sapiens (Human))
Shanghai Pharmaceuticals Holding
US Patent
LigandPNGBDBM444516(US10662186, Compound 38 | US10988476, Compound I-3...)
Affinity DataIC50: >3.00E+4nM. Assay description: 1. Take 10 mM stock solution of the test compound, in 96-well compound plate, DMSO was used to dilute the compound to an initial concentration of 100...
Ligand InfoPC cidPC sid
In DepthDetails US Patent
TargetCyclin-dependent kinase 9(Homo sapiens (Human))
Shanghai Pharmaceuticals Holding
US Patent
LigandPNGBDBM444516(US10662186, Compound 38 | US10988476, Compound I-3...)
Affinity DataIC50:  0.920nM. Assay description: 1. Take 10 mM stock solution of the test compound, in 96-well compound plate, DMSO was used to dilute the compound to an initial concentration of 100...
Ligand InfoPC cidPC sid
In DepthDetails US Patent