BDBM445131 Ethyl 4-(1-(cyano-L-prolyl)indolin-4-yl)-1-(4-methoxybenzyl)-1H-pyrazole-5-carboxylate::US10669234, Example 70
SMILES CCOC(=O)c1c(cnn1Cc1ccc(OC)cc1)B1OC(C)(C)C(C)(C)O1
InChI Key InChIKey=PUZLOIJEZWAGAD-UHFFFAOYSA-N
Data  1 IC50
  Tab Delimited (TSV)   2D SDfile   Computed 3D by Vconf -m prep SDfile
Find this compound or compounds like it in BindingDB:
Activity Spreadsheet -- Enzyme Inhibition Constant Data from BindingDB
Found 1 hit for monomerid = 445131
TargetUbiquitin carboxyl-terminal hydrolase isozyme L1(Homo sapiens (Human))
Mission Therapeutics
US Patent
LigandPNGBDBM445131(Ethyl 4-(1-(cyano-L-prolyl)indolin-4-yl)-1-(4-meth...)
Affinity DataIC50:  5.50E+3nM. Assay description: Dilution plates were prepared at 21 times the final concentration (2100 μM for a final concentration of 100 (μM) in 50% DMSO in a 96-well p...
Ligand InfoPC cidPC sid
In DepthDetails US Patent