BDBM445417 US10683279, Example 14a::US10988458, Example 14a::US11560368, Example 14a
SMILES C[C@H](CF)n1nnnc1-c1cccc(NC(=O)c2cc(c(C)cc2F)-n2cnc(c2)C2CC2)n1
InChI Key InChIKey=NNRMSIBNDAXZEC-CQSZACIVSA-N
Data  3 IC50
  Tab Delimited (TSV)   2D SDfile   Computed 3D by Vconf -m prep SDfile
Find this compound or compounds like it in BindingDB:
Activity Spreadsheet -- Enzyme Inhibition Constant Data from BindingDB
Found 3 hits for monomerid = 445417
TargetMitogen-activated protein kinase kinase kinase 5(Homo sapiens (Human))
Enanta Pharmaceuticals
US Patent
LigandPNGBDBM445417(US10683279, Example 14a | US10988458, Example 14a ...)
Affinity DataIC50:  5.5nM. Assay description: ASK1 was purchased from Thermofisher, ATP was purchased from Sigma , HTRF® KinEASE™ Assay System was obtained from Cisbio (Bedford, Mass). ½ Area pla...
Ligand InfoPC cidPC sid
In DepthDetails US Patent
TargetMitogen-activated protein kinase kinase kinase 5(Homo sapiens (Human))
Enanta Pharmaceuticals
US Patent
LigandPNGBDBM445417(US10683279, Example 14a | US10988458, Example 14a ...)
Affinity DataIC50:  5.5nM. Assay description: ASK1 was purchased from Thermofisher (Catalogue # PV4011), ATP was purchased from Sigma (Catalogue # A7699), HTRF® KinEASE™ Assay System was obtained...
Ligand InfoPC cidPC sid
In DepthDetails US Patent
TargetMitogen-activated protein kinase kinase kinase 5(Homo sapiens (Human))
Enanta Pharmaceuticals
US Patent
LigandPNGBDBM445417(US10683279, Example 14a | US10988458, Example 14a ...)
Affinity DataIC50:  5.5nM. Assay description: ASK1 was purchased from Thermofisher (Catalogue #PV4011), ATP was purchased from Sigma (Catalogue #A7699), HTRF® KinEASE™ Assay System was obtained f...
Ligand InfoPC cidPC sid
In DepthDetails US Patent