BDBM445959 US10669246, Example 11::US10968188, Example 11
SMILES Cc1ccnc(Cl)c1-c1ccc2nc(NC(=O)[C@@H]3C[C@@H]3F)sc2c1
InChI Key InChIKey=DQYQBMXKLGHNLA-MNOVXSKESA-N
Data  4 IC50
  Tab Delimited (TSV)   2D SDfile   Computed 3D by Vconf -m prep SDfile
Find this compound or compounds like it in BindingDB:
Activity Spreadsheet -- Enzyme Inhibition Constant Data from BindingDB
Found 2 hits for monomerid = 445959
TargetTyrosine-protein kinase ABL1(Homo sapiens (Human))
1St Biotherapeutics
US Patent
LigandPNGBDBM445959(US10669246, Example 11 | US10968188, Example 11)
Affinity DataIC50:  8.30nM. Assay description: ADP-Glo assay kit was purchased from Promega. Magnesium chloride (MgCl2), bovine serum albumin (BSA), ethylene glycol-bis(β-aminoethyl ether)-N,...
Ligand InfoPC cidPC sid
In DepthDetails US Patent
TargetTyrosine-protein kinase ABL1(Homo sapiens (Human))
1St Biotherapeutics
US Patent
LigandPNGBDBM445959(US10669246, Example 11 | US10968188, Example 11)
Affinity DataIC50:  8.30nM. Assay description: ADP-Glo assay kit was purchased from Promega. Magnesium chloride (MgCl2), bovine serum albumin (BSA), ethylene glycol-bis(β-aminoethyl ether)-N,...
Ligand InfoPC cidPC sid
In DepthDetails US Patent