BDBM446128 US10669268, Example 2::US10669268, Example 2.01::US10669268, Example 2.02::US10669268, Example 2.03::US10669268, Example 2.04::trans-3,5-Dichlorobenzyl 2-(2-oxo-2,3-dihydrobenzo[d]oxazole-6-carbonyl)hexahydro-1H-pyrrolo[3,4-c]pyridine-5(6H)-carboxylate
SMILES Clc1cc(Cl)cc(COC(=O)N2CC[C@@H]3CN(C[C@H]3C2)C(=O)c2ccc3[nH]c(=O)oc3c2)c1
InChI Key
Data  5 IC50
  Tab Delimited (TSV)   2D SDfile   Computed 3D by Vconf -m prep SDfile
Find this compound or compounds like it in BindingDB:
Activity Spreadsheet -- Enzyme Inhibition Constant Data from BindingDB
Found 5 hits for monomerid = 446128
TargetAtaxin-1(Homo sapiens (Human))
Hoffmann-La Roche
US Patent
LigandPNGBDBM446128(US10669268, Example 2 | US10669268, Example 2.01 |...)
Affinity DataIC50:  10nM. Assay description: ATX inhibition was measured by a fluorescence quenching assay using a specifically labeled substrate analogue (MR121 substrate). To obtain this MR121...
Ligand InfoPC cidPC sid
In DepthDetails US Patent
TargetAtaxin-1(Homo sapiens (Human))
Hoffmann-La Roche
US Patent
LigandPNGBDBM446128(US10669268, Example 2 | US10669268, Example 2.01 |...)
Affinity DataIC50:  5nM. Assay description: ATX inhibition was measured by a fluorescence quenching assay using a specifically labeled substrate analogue (MR121 substrate). To obtain this MR121...
Ligand InfoPC cidPC sid
In DepthDetails US Patent
TargetAtaxin-1(Homo sapiens (Human))
Hoffmann-La Roche
US Patent
LigandPNGBDBM446128(US10669268, Example 2 | US10669268, Example 2.01 |...)
Affinity DataIC50:  8nM. Assay description: ATX inhibition was measured by a fluorescence quenching assay using a specifically labeled substrate analogue (MR121 substrate). To obtain this MR121...
Ligand InfoPC cidPC sid
In DepthDetails US Patent
TargetAtaxin-1(Homo sapiens (Human))
Hoffmann-La Roche
US Patent
LigandPNGBDBM446128(US10669268, Example 2 | US10669268, Example 2.01 |...)
Affinity DataIC50:  5nM. Assay description: ATX inhibition was measured by a fluorescence quenching assay using a specifically labeled substrate analogue (MR121 substrate). To obtain this MR121...
Ligand InfoPC cidPC sid
In DepthDetails US Patent
TargetAtaxin-1(Homo sapiens (Human))
Hoffmann-La Roche
US Patent
LigandPNGBDBM446128(US10669268, Example 2 | US10669268, Example 2.01 |...)
Affinity DataIC50:  6nM. Assay description: ATX inhibition was measured by a fluorescence quenching assay using a specifically labeled substrate analogue (MR121 substrate). To obtain this MR121...
Ligand InfoPC cidPC sid
In DepthDetails US Patent