BDBM446143 US10669268, Example 4.10::trans-3,5-dichlorobenzyl 5-(1H-benzo[d][1,2,3]triazole-5-carbonyl)hexahydro-1H-pyrrolo[3,4-c]pyridine-2(3H)-carboxylate
SMILES Clc1cc(Cl)cc(COC(=O)N2C[C@H]3CCN(C[C@@H]3C2)C(=O)c2ccc3[nH]nnc3c2)c1
InChI Key
Data  1 IC50
  Tab Delimited (TSV)   2D SDfile   Computed 3D by Vconf -m prep SDfile
Find this compound or compounds like it in BindingDB:
Activity Spreadsheet -- Enzyme Inhibition Constant Data from BindingDB
Found 1 hit for monomerid = 446143
TargetAtaxin-1(Homo sapiens (Human))
Hoffmann-La Roche
US Patent
LigandPNGBDBM446143(US10669268, Example 4.10 | trans-3,5-dichlorobenzy...)
Affinity DataIC50:  4nM. Assay description: ATX inhibition was measured by a fluorescence quenching assay using a specifically labeled substrate analogue (MR121 substrate). To obtain this MR121...
Ligand InfoPC cidPC sid
In DepthDetails US Patent