BDBM446263 US10669268, Example 15.58::US10669268, Example 15.78
SMILES FC(F)(F)c1ccc(\C=C\C(=O)N2C[C@@H]3CN(C[C@H]3C2)C(=O)c2ccc3[nH]nnc3c2)cc1
InChI Key
Data  2 IC50
  Tab Delimited (TSV)   2D SDfile   Computed 3D by Vconf -m prep SDfile
Find this compound or compounds like it in BindingDB:
Activity Spreadsheet -- Enzyme Inhibition Constant Data from BindingDB
Found 2 hits for monomerid = 446263
TargetAtaxin-1(Homo sapiens (Human))
Hoffmann-La Roche
US Patent
LigandPNGBDBM446263(US10669268, Example 15.58 | US10669268, Example 15...)
Affinity DataIC50:  9nM. Assay description: ATX inhibition was measured by a fluorescence quenching assay using a specifically labeled substrate analogue (MR121 substrate). To obtain this MR121...
Ligand InfoPC cidPC sid
In DepthDetails US Patent
TargetAtaxin-1(Homo sapiens (Human))
Hoffmann-La Roche
US Patent
LigandPNGBDBM446263(US10669268, Example 15.58 | US10669268, Example 15...)
Affinity DataIC50:  5nM. Assay description: ATX inhibition was measured by a fluorescence quenching assay using a specifically labeled substrate analogue (MR121 substrate). To obtain this MR121...
Ligand InfoPC cidPC sid
In DepthDetails US Patent