BDBM446280 US10669268, Example 15.75
SMILES FC(F)(F)Oc1ccc(\C=C\C(=O)N2C[C@H]3CCN(C[C@@H]3C2)C(=O)c2ccc3[nH]nnc3c2)cc1Cl
InChI Key
Data  1 IC50
  Tab Delimited (TSV)   2D SDfile   Computed 3D by Vconf -m prep SDfile
Find this compound or compounds like it in BindingDB:
Activity Spreadsheet -- Enzyme Inhibition Constant Data from BindingDB
Found 1 hit for monomerid = 446280
TargetAtaxin-1(Homo sapiens (Human))
Hoffmann-La Roche
US Patent
LigandPNGBDBM446280(US10669268, Example 15.75)
Affinity DataIC50:  5nM. Assay description: ATX inhibition was measured by a fluorescence quenching assay using a specifically labeled substrate analogue (MR121 substrate). To obtain this MR121...
Ligand InfoPC cidPC sid
In DepthDetails US Patent