BDBM446328 1-[(3aS,8aR)-2-(1H-benzotriazole-5-carbonyl)-1,3,3a,4,5,7,8,8a-octahydropyrrolo[3,4-d]azepin-6-yl]-3-[3-fluoro-4-(2,2,2-trifluoroethoxy)phenyl]propan-1-one::US10669268, Example 1.44
SMILES Fc1cc(CCC(=O)N2CC[C@@H]3CN(C[C@@H]3CC2)C(=O)c2ccc3[nH]nnc3c2)ccc1OCC(F)(F)F
InChI Key
Data  1 IC50
  Tab Delimited (TSV)   2D SDfile   Computed 3D by Vconf -m prep SDfile
Find this compound or compounds like it in BindingDB:
Activity Spreadsheet -- Enzyme Inhibition Constant Data from BindingDB
Found 1 hit for monomerid = 446328
TargetAtaxin-1(Homo sapiens (Human))
Hoffmann-La Roche
US Patent
LigandPNGBDBM446328(1-[(3aS,8aR)-2-(1H-benzotriazole-5-carbonyl)-1,3,3...)
Affinity DataIC50:  3nM. Assay description: ATX inhibition was measured by a fluorescence quenching assay using a specifically labeled substrate analogue (MR121 substrate). To obtain this MR121...
Ligand InfoPC cidPC sid
In DepthDetails US Patent