BDBM448409 1-[(6-{3-Azabicyclo[3.1.0]hexan-3-yl}-2-methyl-::US10695334, Example 98
SMILES Cc1[nH]nc2[C@@H](CCc12)NC(=O)c1cn(Cc2ccc(nc2C)N2CC3CC3C2)c(n1)C(F)(F)F
InChI Key
Data  1 KI  1 IC50
  Tab Delimited (TSV)   2D SDfile   Computed 3D by Vconf -m prep SDfile
Find this compound or compounds like it in BindingDB:
Activity Spreadsheet -- Enzyme Inhibition Constant Data from BindingDB
Found 2 hits for monomerid = 448409
TargetPlasma kallikrein(Homo sapiens (Human))
Boehringer Ingelheim International
US Patent
LigandPNGBDBM448409(1-[(6-{3-Azabicyclo[3.1.0]hexan-3-yl}-2-methyl- | ...)
Affinity DataKi:  6nM. Assay description: Human PKK (1.78 nM or 0.025 U/mL; Enzyme Research Laboratories) was incubated at 24° C. with 0.25 mM fluorogenic substrate H-Pro-Phe-Arg-AMC (11295 f...
Ligand InfoPC cidPC sid
In DepthDetails US Patent
TargetThymidine kinase, cytosolic(Homo sapiens (Human))
Boehringer Ingelheim International
US Patent
LigandPNGBDBM448409(1-[(6-{3-Azabicyclo[3.1.0]hexan-3-yl}-2-methyl- | ...)
Affinity DataIC50: >1.00E+4nM. Assay description: Prior to the assay, human TK1 (R&D Systems) was activated by incubation with human trypsin (Calbiochem) in a 1:10,000 ratio for 15 min at 37° C. For ...
Ligand InfoPC cidPC sid
In DepthDetails US Patent