BDBM450456 9H-Fluoren-9-ylmethyl 4-[3-[2- [(3,4-dichlorophenyl)methyl- amino]-2-oxoethyl]-4- oxoquinazolin-6-yl] piperazine-1-carboxylate (intermediate A-5) and cyclohexanecarbonyl chloride ([CAS RN 2719-27-9])::US10676446, Example 65
SMILES Clc1ccc(CNC(=O)Cn2cnc3ccc(cc3c2=O)N2CCN(CC2)C(=O)C2CCCCC2)cc1Cl
InChI Key InChIKey=AXJOUYQVVPBZQJ-UHFFFAOYSA-N
Data  1 IC50
  Tab Delimited (TSV)   2D SDfile   Computed 3D by Vconf -m prep SDfile
Find this compound or compounds like it in BindingDB:
Activity Spreadsheet -- Enzyme Inhibition Constant Data from BindingDB
Found 1 hit for monomerid = 450456
TargetEctonucleotide pyrophosphatase/phosphodiesterase family member 2(Homo sapiens (Human))
Hoffmann-La Roche
US Patent
LigandPNGBDBM450456(9H-Fluoren-9-ylmethyl 4-[3-[2- [(3,4-dichloropheny...)
Affinity DataIC50:  10nM. Assay description: ATX inhibition was measured by a fluorescence quenching assay using a specifically labeled substrate analogue (MR121 substrate). To obtain this MR121...
Ligand InfoPC cidPC sid
In DepthDetails US Patent