BDBM450540 2-[6-[1-(9H- Fluoren-9- ylmethoxycarbonyl)- 4-piperidyl]-4- oxoquinazolin-3- yl]acetic acid (intermediate A-8) and 2-chloro-4- (methylaminomethyl) benzonitrile hydrochloride (example 56, step A)::US10676446, Example 125
SMILES CN(Cc1ccc(C#N)c(Cl)c1)C(=O)Cn1cnc2ccc(cc2c1=O)C1CCN(CC1)C(C)=O
InChI Key InChIKey=NOCAIBYMDMOXIX-UHFFFAOYSA-N
Data  1 IC50
  Tab Delimited (TSV)   2D SDfile   Computed 3D by Vconf -m prep SDfile
Find this compound or compounds like it in BindingDB:
Activity Spreadsheet -- Enzyme Inhibition Constant Data from BindingDB
Found 1 hit for monomerid = 450540
TargetEctonucleotide pyrophosphatase/phosphodiesterase family member 2(Homo sapiens (Human))
Hoffmann-La Roche
US Patent
LigandPNGBDBM450540(2-[6-[1-(9H- Fluoren-9- ylmethoxycarbonyl)- 4-pipe...)
Affinity DataIC50:  7nM. Assay description: ATX inhibition was measured by a fluorescence quenching assay using a specifically labeled substrate analogue (MR121 substrate). To obtain this MR121...
Ligand InfoPC cidPC sid
In DepthDetails US Patent