BDBM450549 N-[(3-Chloro-4- cyanophenyl)methyl]-N- methyl-2-(4-oxo-6- piperidin-4-ylquinazolin- 3-yl)acetamide (intermediate A-9) and 3- methoxypropanoic acid ([CAS RN 2544-06-1])::US10676446, Example 134
SMILES COCCC(=O)N1CCC(CC1)c1ccc2ncn(CC(=O)N(C)Cc3ccc(C#N)c(Cl)c3)c(=O)c2c1
InChI Key InChIKey=GJUKXAFCNDKUCJ-UHFFFAOYSA-N
Data  1 IC50
  Tab Delimited (TSV)   2D SDfile   Computed 3D by Vconf -m prep SDfile
Find this compound or compounds like it in BindingDB:
Activity Spreadsheet -- Enzyme Inhibition Constant Data from BindingDB
Found 1 hit for monomerid = 450549
TargetEctonucleotide pyrophosphatase/phosphodiesterase family member 2(Homo sapiens (Human))
Hoffmann-La Roche
US Patent
LigandPNGBDBM450549(N-[(3-Chloro-4- cyanophenyl)methyl]-N- methyl-2-(4...)
Affinity DataIC50:  1nM. Assay description: ATX inhibition was measured by a fluorescence quenching assay using a specifically labeled substrate analogue (MR121 substrate). To obtain this MR121...
Ligand InfoPC cidPC sid
In DepthDetails US Patent