BDBM450554 N-[(3-Chloro-4- cyanophenyl)methyl]-N- methyl-2-(4-oxo-6- piperidin-4-ylquinazolin- 3-yl)acetamide (intermediate A-9) and 3- fluorocyclobutane carboxylic acid ([CAS RN 122665-96-7])::US10676446, Example 138
SMILES CN(Cc1ccc(C#N)c(Cl)c1)C(=O)Cn1cnc2ccc(cc2c1=O)C1CCN(CC1)C(=O)C1CC(F)C1
InChI Key InChIKey=BTIZMTNKZYOHPD-UHFFFAOYSA-N
Data  1 IC50
  Tab Delimited (TSV)   2D SDfile   Computed 3D by Vconf -m prep SDfile
Find this compound or compounds like it in BindingDB:
Activity Spreadsheet -- Enzyme Inhibition Constant Data from BindingDB
Found 1 hit for monomerid = 450554
TargetEctonucleotide pyrophosphatase/phosphodiesterase family member 2(Homo sapiens (Human))
Hoffmann-La Roche
US Patent
LigandPNGBDBM450554(N-[(3-Chloro-4- cyanophenyl)methyl]-N- methyl-2-(4...)
Affinity DataIC50:  3nM. Assay description: ATX inhibition was measured by a fluorescence quenching assay using a specifically labeled substrate analogue (MR121 substrate). To obtain this MR121...
Ligand InfoPC cidPC sid
In DepthDetails US Patent