BDBM451302 US10709709, Example 129
SMILES Cc1cc2CCNCc2c(O[C@H]2C[C@H]([C@H](O)[C@@H]2O)n2cc(Cl)c3c(N)ncnc23)c1
InChI Key InChIKey=LFMSIFZDQXVWRB-TWKWOARYSA-N
Data  1 IC50
  Tab Delimited (TSV)   2D SDfile   Computed 3D by Vconf -m prep SDfile
Find this compound or compounds like it in BindingDB:
Activity Spreadsheet -- Enzyme Inhibition Constant Data from BindingDB
Found 1 hit for monomerid = 451302
TargetProtein arginine N-methyltransferase 5(Homo sapiens (Human))
Pfizer
US Patent
LigandPNGBDBM451302(US10709709, Example 129)
Affinity DataIC50:  1nM. Assay description: Compounds were solubilized in DMSO and serially diluted, using 3-fold dilutions, into 100% DMSO at a concentration 50-fold greater than the desired a...
Ligand InfoPC cidPC sid
In DepthDetails US Patent