BDBM454172 US10716791, Code KP-305
SMILES Cn1cccc1C(=O)N[C@@H](Cn1ccnc1)C(=O)NCc1ccccc1
InChI Key InChIKey=RBODVIKNZSXEAK-INIZCTEOSA-N
Data  3 KI
  Tab Delimited (TSV)   2D SDfile   Computed 3D by Vconf -m prep SDfile
Find this compound or compounds like it in BindingDB:
Activity Spreadsheet -- Enzyme Inhibition Constant Data from BindingDB
Found 3 hits for monomerid = 454172
TargetProtein-arginine deiminase type-2(Mus musculus)
University Health Network
US Patent
LigandPNGBDBM454172(US10716791, Code KP-305)
Affinity DataKi:  5.80E+4nM. Assay description: Materials: PAD1, PAD2, PAD3 and PAD4 were purchased from commercial sources. Assay buffer: 50 mM Tris pH 7.5, 100 mM NaCl, 10 mM CaCl2, 5 mM DTT. Col...
Ligand InfoPC cidPC sid
In DepthDetails US Patent
TargetProtein-arginine deiminase type-4(Homo sapiens (Human))
University Health Network
US Patent
LigandPNGBDBM454172(US10716791, Code KP-305)
Affinity DataKi:  7.50E+4nM. Assay description: Materials: PAD1, PAD2, PAD3 and PAD4 were purchased from commercial sources. Assay buffer: 50 mM Tris pH 7.5, 100 mM NaCl, 10 mM CaCl2, 5 mM DTT. Col...
Ligand InfoPC cidPC sid
In DepthDetails US Patent
TargetProtein-arginine deiminase type-1(Homo sapiens (Human))
University Health Network
US Patent
LigandPNGBDBM454172(US10716791, Code KP-305)
Affinity DataKi:  1.47E+5nM. Assay description: Materials: PAD1, PAD2, PAD3 and PAD4 were purchased from commercial sources. Assay buffer: 50 mM Tris pH 7.5, 100 mM NaCl, 10 mM CaCl2, 5 mM DTT. Col...
Ligand InfoPC cidPC sid
In DepthDetails US Patent